Problem when downloading mods for Skyrim through the NMM (Nexus Mod Manager)

When trying to download two mods (the most recent Apachii Hair Mod and a Dagi-Raht race mod) I got this error message: A problem occurred during the install The execution has failed due to the bug...

Id #14141 | Release: None | Updated: Wed at 1:58 AM by VixenLiron | Created: Wed at 1:58 AM by VixenLiron

Every time when i try to install a mod it says that there is a bug with SevenZip. What do i do???

When i try to install a mod it says that there is an error with SevenZip

Id #14136 | Release: None | Updated: Oct 6 at 6:36 PM by TheNetFreak | Created: Oct 4 at 4:15 PM by xDanielxRo

I Had a problem with SevenZipSharp wile using PackageMod

Wile I was trying to Pack my coded data i had a problem using SevenZIpSharp Recieved the following Mensage: error MSB4018: The "PackageMod" task failed unexpectedly. SevenZip.SevenZipException:...

Id #14133 | Release: None | Updated: Sep 25 at 5:24 AM by mthibau | Created: Sep 25 at 5:24 AM by mthibau

minor solution

I had this error sevenzipsharp, uninstall any anti-virus. You don't need to uninstall. Remember if you have Skyrim Special Edition SE, you cannot use a script extender mod and you must search under...

Id #14126 | Release: None | Updated: Aug 18 at 1:26 AM by drakner | Created: Aug 18 at 1:26 AM by drakner

Solution to nmm failing to install mods

i uninstalled byte fence anti malware and i can install mods now

Id #14121 | Release: None | Updated: Jul 20 at 11:54 PM by Kerch00 | Created: Jul 20 at 11:54 PM by Kerch00

Cant install Mods in Skyrim with NMM

Always the same Info The execution has failed ......... bug in SevenZipSharp Please report about ............... ApachiiSkyHaiFemale V1.5 and V1.6 CBBE V3.4f Lunari Race V1.7 and so on Some Mods a...

Id #14119 | Release: None | Updated: Jul 17 at 4:05 AM by Schlecht | Created: Jul 17 at 3:58 AM by Schlecht

i problem install mod cbbe

i want to install mod cbbe

Id #14117 | Release: None | Updated: Jul 17 at 3:54 AM by Schlecht | Created: Jul 14 at 3:56 PM by nuarb

Execution has failed

Not sure when this started happening... 0.64.3890.29348 The execution has failed due to the bug in the SevenZipSharp. http://sevenzipsharp.codeplex.com/WorkItem/List.aspx, post the release number ...

Id #14116 | Release: None | Updated: Jul 14 at 10:09 AM by SCairns | Created: Jul 14 at 10:09 AM by SCairns

i not install

sevenzipsharp not install

Id #14115 | Release: None | Updated: Jul 8 at 2:09 PM by nuarb | Created: Jul 8 at 2:06 PM by nuarb

Cant install mod on Nexus Mod Manager

The execution has had due to bug in the SevenZipSharp.How do we fix this? and will there be a update to fix it? pls help

Id #14108 | Release: None | Updated: Wed at 2:00 AM by VixenLiron | Created: Jun 5 at 2:43 PM by TheRedOstrich

Issue Installing Printer

I'm not really sure what the issue is but this is what the error dialogue box says: 2017-05-31 12:07:39 [INFO] Loading limited setup (http://134.226.101.24/webapp/clientsetupjson) 2017-05-31 12:07...

Id #14107 | Release: None | Updated: Jun 19 at 10:55 PM by FluFFyPuPPi3 | Created: May 31 at 11:16 AM by marshki

Mods in Nexus Mod Manager Not installing

Whenever I download a mod the mod will successfully download, but when i go to install the mod it says that there is a bug in SevenZipSharp

Id #14105 | Release: None | Updated: Jul 6 at 2:49 PM by IDontHack | Created: May 18 at 8:17 PM by 13randon13

Nexus Mod manager problems (and how I fixed them)

I had an ongoing problem with skyrim and installing mods through it, and, although I can't promise this will help you, this fixed my issue. I saw multiple times that the problem was caused by peopl...

Id #14101 | Release: None | Updated: Jun 28 at 5:58 AM by JoaquinJJ | Created: May 7 at 1:20 AM by Kandall0516

I can't install any mods

So are you ever going to fix the bug orrr

Id #14100 | Release: None | Updated: May 11 at 11:53 PM by sczor | Created: May 6 at 1:39 PM by lanimotionless

Won't Install mods through nexus mod manager.

Each mod goes through the download process and completes, but an error message occurs claiming the execution has failed due to a bug in the SevenZipSharp.

Id #14096 | Release: None | Updated: May 18 at 8:13 PM by 13randon13 | Created: May 2 at 10:24 PM by zeiglerg41

How to achieve same compression speed

I am looking for a fast way to create a .zip archive of a directory that contains a lot of small files (e.g. 25.4 MB, 8 directories and 4505 files, but could be larger). When I use the standard 7z...

Id #14092 | Release: None | Updated: May 9 at 8:51 PM by Fluckl | Created: Apr 19 at 9:18 AM by tabina

Won't install mods through Nexus Mod Manager

`”The execution has failed due to the bug in the SevenZipSharp”. It happens when i try to install an mod through NMM which prevents successful installation. I do not not what ”The Bug” is, but i h...

Id #14090 | Release: None | Updated: Jun 21 at 3:50 PM by Hanzo1998 | Created: Apr 18 at 7:21 PM by DogeCore

Doesn't work with 7z Version 16 and higher

I get a message like "Invalid archive: open/read error! Is it encrypted and a wrong password was provided? If your archive is an exotic one, it is possible that SevenZipSharp has no signature for i...

Id #14085 | Release: None | Updated: Apr 6 at 7:21 AM by kwrl | Created: Apr 6 at 7:21 AM by kwrl

won't let me install the mod using the nexus mod manager.

Id #105803| Release: None | Updated: Today at 4:01 PM by PandaVigilante | Created: July 10 2015, at 11:36 AM by skyorange

Id #14082 | Release: None | Updated: Jun 21 at 3:50 PM by Hanzo1998 | Created: Mar 24 at 8:06 PM by PandaVigilante

CAN'T INSTALL MODS NEXUS MOD MANAGER

FIX THIS

Id #14080 | Release: None | Updated: Jun 21 at 3:51 PM by Hanzo1998 | Created: Mar 24 at 6:15 AM by badwolfeidolon

I Cant install mods

When I try to install mods it gives me an error saying its a buy in seven zip sharp, I disable my anti-virus, and I have plenty of hardrive space and nothing changes how do I fix this

Id #14056 | Release: None | Updated: Jun 21 at 3:51 PM by Hanzo1998 | Created: Feb 15 at 2:45 AM by UlyssesPride

Mod Configuration Menu, Fallout: NV, through NMM

Never had an issue with this mod. Simply won't install and I am at a loss. My anti-virus is disabled so that is definitely not it.

Id #14050 | Release: None | Updated: May 6 at 3:37 AM by Heazie | Created: Feb 1 at 11:26 PM by nathan_hale53

Big mods wont install. Keep getting error directory to here

Only small mods will install for some reason. Everyone seems to be having this issue. Fix this shit

Id #14023 | Release: None | Updated: Jun 21 at 3:52 PM by Hanzo1998 | Created: Dec 23, 2016 at 2:07 AM by codyw2277

Mods not working

I can't install any mods for Fallout 4 or Skyrim. Keep getting an error about a bug in SevenZipSharp. Very frustrating. Plan on making it completely not a pile of shit?

Id #14010 | Release: None | Updated: Jun 21 at 3:49 PM by Hanzo1998 | Created: Nov 12, 2016 at 10:53 PM by zomboman

NO MODS WILL WORK

Mods for Skyrim, Fallout 4, and Fallout New Vegas won't install. Everyone's been posting this, please do something about this.

Id #14007 | Release: None | Updated: Jun 21 at 3:52 PM by Hanzo1998 | Created: Nov 6, 2016 at 4:04 PM by Sivvy01

Skyrim mods cannot be activated by Nexus Mod Manager

Never encountered this issue before, there are no workarounds other than manually installing all mods. This error occurs for almost every mod I attempt to install, almost. Exchange Currency, Imme...

Id #14006 | Release: None | Updated: Jun 21 at 3:52 PM by Hanzo1998 | Created: Nov 4, 2016 at 5:27 PM by insectopod

fallout 4 and skyrim mods not working

whenever I try to activate a mod it pops up with this link and will not open or work this caused my Skyrim game to not work but for fallout4 these are the mods that wont work shofar Caliente's ...

Id #14003 | Release: None | Updated: Apr 8 at 6:58 AM by walonew | Created: Oct 23, 2016 at 7:57 PM by Closingspy14111

Parallel Foreach giving issue in compression

Hi, I have used parallel foreach in my project which compresses number of text files present in a particular folder. I have executed the project n number of times and some folders are giving issu...

Id #13998 | Release: None | Updated: Jan 31 at 2:54 PM by trebor678 | Created: Oct 18, 2016 at 7:26 AM by pgaykar

Skyrim mod can't install!

I can't install mods because it keeps popping up with a error says: "A problem occurred during install: the execution has failed due to the bug in the SevenZipShare. Please report about it to https...

Id #13993 | Release: None | Updated: Apr 8 at 6:59 AM by walonew | Created: Oct 8, 2016 at 9:02 AM by IvenHor

Tale of Two Wastelands (TTW)

Hey can anyone help me install this mod for Fallout NV i always get the message to use this and put the version down so im using late less FOMM and TTW Version 2.9.4 can anyone please help me

Id #13984 | Release: None | Updated: Oct 12, 2016 at 8:53 AM by Andoion | Created: Sep 16, 2016 at 5:48 AM by NeitherSoldier

Can not insall

I try click on the witcher 3 it can not install!!

Id #13975 | Release: None | Updated: Sep 1, 2016 at 8:44 AM by martin2001 | Created: Sep 1, 2016 at 8:43 AM by martin2001

Mods failing randomly to install

I wanted to attach an example of a number of compressed files, bt thay are over your lmit for uploads, just work this bug around

Id #13971 | Release: None | Updated: Dec 22, 2016 at 5:50 PM by LoneDirewolf | Created: Aug 31, 2016 at 1:41 AM by Ryokencorp

Extraction Problem

Hi, I see an issue in extracting the zip file. One of the file having single quoted in its name. when we extract manually it is working, but when we tried using this library it is failing. Is there...

Id #13961 | Release: None | Updated: Aug 19, 2016 at 6:32 AM by chravikishore | Created: Aug 19, 2016 at 6:32 AM by chravikishore

Help for Skyrim mOd Not Activated

Now the problem is an Error while installing this Creator pack and framework for skyrim mod help me please to find out why this is happening thanks and more power

Id #13955 | Release: None | Updated: Nov 16, 2016 at 2:29 AM by StevenKimsey95 | Created: Aug 4, 2016 at 4:33 AM by earlkaizer

A Problem Occurring when trying to activate mods

I have tried to activate mods but all of them (20) are not activating, then just go Idle and say a problem has occurred.

Id #13953 | Release: None | Updated: Mar 24 at 7:22 PM by Najg01 | Created: Aug 2, 2016 at 3:00 PM by xfactor4135

Skyrim mod not installed (Nexus Mod Manager)

I just downloaded enhanced lightning and fx, and skyrim flora overhaul but then it showed "A problem occured during install: The execution has failed due to the bug in the sevenzip sharp. please re...

Id #13952 | Release: None | Updated: Mar 24 at 7:22 PM by Najg01 | Created: Aug 2, 2016 at 5:59 AM by andreaskur

Won't Activate my Mod

I trying to activate my XP32 Maximum skeleton mod on nexus mod manager but it won't work! It keeps telling me a problem occurred during install! I have restarted my computer several times and its s...

Id #13951 | Release: None | Updated: Sep 4, 2016 at 5:34 PM by drunkendonkey64 | Created: Aug 1, 2016 at 9:48 AM by andythepro

Bug in SevenZipSharp

I have the nexus mod manager and every time I try to install a mod I get the error message that a bug has occurred in SevenZipSharp and to report it to this site. I have moved all of my games to a ...

Id #13947 | Release: None | Updated: Mar 28 at 9:39 AM by Alfie1 | Created: Jul 22, 2016 at 4:36 PM by littlezoid

Install Fail

When trying to install Merta Assassin Armor UNP - CBBE - Merta Assassin Tattoos(Optional File/Nexus Mods), Merta Assassin Armor UNP - CBBE - C. Merta Assassin Armor High Heels CBBE(veersion 1.0/Nex...

Id #13944 | Release: None | Updated: Jul 28, 2016 at 2:30 PM by Just4lols | Created: Jul 20, 2016 at 6:48 AM by AssassinSasha25

Installation

When trying to install immersive horses this popped up. The execution has failed due to the bug in the SevenZipSharp. Please report about it to http://sevenzipsharp.codeplex.com/WorkItem/List.as...

Id #13939 | Release: None | Updated: Oct 8, 2016 at 11:59 AM by Kyunay | Created: Jul 13, 2016 at 9:27 AM by Juliekoob

Install Fail

Nexus Mod Manager R:0.61.23 Game Skyrim Immersive Armors v7_1-19733-7-1 // A problem occurred during install: The execution has failed due to the bug in the SevenZipSharp. Please report about i...

Id #13937 | Release: None | Updated: Aug 30, 2016 at 1:27 AM by halestormfan166 | Created: Jul 11, 2016 at 8:16 PM by gabrielferrara

Multiple file extract throw error.

Hi, I am using SevenZipExtractor. When i extract multiple files in multiple threads some times it throws error. The given key was not present in the dictionary or Could not extract files! Messag...

Id #13927 | Release: None | Updated: Jul 28, 2016 at 2:30 PM by Just4lols | Created: Jun 24, 2016 at 6:57 AM by uraman

NMM 0.5.61 failed install mod from 7z file because bug SevenZipSharp

(Skyrim, Mod "beyond reach", ultra compressed as .7z, installation failed, the 7z package is 741 MB big, expanded it is 1.9 GB, checked by 7z it's OK) error message of NMM: BeyondReach3.2_mit_deut...

Id #13918 | Release: None | Updated: Jun 9, 2016 at 5:39 AM by KageRedux | Created: Jun 8, 2016 at 10:33 PM by dreifels

DrWeb AV detect trojan in 7zxSD_LZMA2.sfx

Please check files in repo

Id #13912 | Release: None | Updated: May 31, 2016 at 7:46 AM by quazi_node | Created: May 31, 2016 at 7:46 AM by quazi_node

SevenZipExtractor causes UnauthorizedAccessException for archives on CDs/DVDs

I'm trying to extract a .7z.001 file stored on a CD. If I initialize the SevenZipExtractor with the string-parameter (file path) constructor, I get UnauthorizedAccessException when accessing its p...

Id #13908 | Release: None | Updated: May 30, 2016 at 1:02 PM by chralf | Created: May 27, 2016 at 12:19 PM by chralf

Expand-Archive : The execution has failed due to the bug in the SevenZipSharp.

We use Expand-Archive to extract files from a zip archive. It used to work before, but right after a Windows update, it started throwing the issue below: Expand-Archive : The execution has failed d...

Id #13904 | Release: None | Updated: Jul 7, 2016 at 2:30 AM by Superethan2004 | Created: May 6, 2016 at 1:50 PM by viktor2016

OutOfMemeory exception

Hi I am using the SevenZipCompressor to compress a directory to zip file. The directory is huge around 1.5GB. When trying to compress this directory I occasionally get OutOfMemory I use the foll...

Id #13867 | Release: None | Updated: Mar 17, 2016 at 6:13 AM by sanketpattekar | Created: Mar 17, 2016 at 6:13 AM by sanketpattekar

Handling events

The events do work. I can see status. However, The events can all fire and the compression is still happening. The events need to be synced a bit better to show the correct status. Maybe add an...

Id #13836 | Release: None | Updated: Feb 13, 2016 at 5:32 AM by vbjay | Created: Feb 13, 2016 at 5:32 AM by vbjay

VolumeSize Limit Is Too Low

SevenZipCompressor.VolumeSize determines the maximum size in bytes of an archive volume. Since this is an int value, the upper limit is 2 GB and does not allow for DVD sizes. This value should be ...

Id #13830 | Release: None | Updated: Feb 3, 2016 at 12:40 PM by chralf | Created: Feb 3, 2016 at 12:40 PM by chralf

Error installing mod?

'The execution has failed due to a bug in SevenZipSharp' One. I don't have SevenZipSharp.. So there cant be a bug, I've used the modding program in the past and not had problems Two. I don't unde...

Id #13822 | Release: None | Updated: Apr 23, 2016 at 4:21 AM by Sparhawk | Created: Jan 21, 2016 at 5:31 PM by shinxie

Type initialization exception in SevenZip.SevenZip.SevenZipLibraryManager

Hello! I found a bug which disallow application developer to embed SevenZip library into his application executable. After some research in the source code and tests, the source of the problem is ...

Id #13693 | Release: None | Updated: Aug 25, 2015 at 5:39 PM by Soukyan | Created: Aug 25, 2015 at 5:38 PM by Soukyan

Lzma ZIP compression exception

Following exception occurs when OutArchiveFormat is Zip or SevenZip and CompressionMethod.Lzma or Lzma2 Tested in your WPF example. I need Lzma as it looks like it is the only one provides progres...

Id #13645 | Release: None | Updated: Jul 16, 2015 at 5:59 PM by milosp | Created: Jul 16, 2015 at 5:59 PM by milosp

exception during archiving

The execution has failed due to the bug in the SevenZipSharp. Please report about it to http://sevenzipsharp.codeplex.com/WorkItem/List.aspx, post the release number and attach the archive.

Id #13642 | Release: None | Updated: Jan 19, 2016 at 12:39 AM by 1ofthenoobs | Created: Jul 15, 2015 at 9:58 AM by afifior

Failed to zip Big files (300Mb)

Hello I think is better don't attach... COde: try { SevenZipCompressor.SetLibraryPath(Application.StartupPath + "/Dlls/7za.dll"); SevenZip.SevenZipCompressor szc = new...

Id #13635 | Release: None | Updated: Jan 18, 2016 at 5:53 AM by TarunJindal | Created: Jun 29, 2015 at 12:13 PM by subscriptionsAge

File Corrupted

Hi, I have this exception on extrat file Invalid archive: open/read error! Is it encrypted and a wrong password was provided? If your archive is an exotic one, it is possible that SevenZipSharp ...

Id #13631 | Release: None | Updated: Mar 3, 2016 at 8:23 PM by IvanEMujicaR | Created: Jun 25, 2015 at 12:47 PM by joaquimabpais

Hi please update DLL and also release nuget 64bit package

The downloaded 64 bit custom dll fails with following error when i try to add as a reference Microsoft Visual Studio A reference to 'C:\Program Files\7-Zip\7z.dll' could not be added. Please make s...

Id #13526 | Release: None | Updated: Apr 2, 2015 at 11:49 PM by PokemonCraft | Created: Apr 2, 2015 at 11:49 PM by PokemonCraft

The compression has failed for an unknown reason with code -2147024882

Hi all, Iam using 7z.dll of 9.20 version. I am able to generate compressed files of small size. While generating compressed file for large files I am getting "The compression has failed for an unk...

Id #13482 | Release: None | Updated: Mar 3, 2015 at 6:23 AM by dpcodeplex | Created: Mar 2, 2015 at 10:04 AM by dpcodeplex

Long Path Exception

While running the unzip it's throw the exception on Long Path exception. SevenZip.SevenZipExtractor ext = new SevenZip.SevenZipExtractor(SourceFile); ext.ExtractArchive(ExtractedFolderLocation);...

Id #13470 | Release: None | Updated: Feb 23, 2015 at 3:47 AM by surazmalla | Created: Feb 23, 2015 at 3:47 AM by surazmalla

Dmg file Invalid archive: open/read error!

Hi : I am using SevenZipSharp dll. I am extracting files anf folders from dmg file. Some dmg files are created using read_write and encryption option to save. But this types of dmg s not extracted...

Id #13426 | Release: None | Updated: Jan 21, 2015 at 8:32 AM by ssgtmp | Created: Jan 21, 2015 at 8:32 AM by ssgtmp

Create Multivolume Zip File.

have you added support for multi volume Zip file ? thanks Kalpesh Chhatrala

Id #13425 | Release: None | Updated: Jan 20, 2015 at 10:07 AM by kalpesh2804 | Created: Jan 20, 2015 at 10:07 AM by kalpesh2804

SevenZipSharp Error

hello, I currently encounters an error ith SevenZipSharp and as requested I post the error. The version of SevenZipSharp is 0.64.5465.19261 What would cause ? The compressed file is larger than...

Id #13368 | Release: None | Updated: Feb 3, 2015 at 12:40 PM by liberasoft | Created: Dec 19, 2014 at 6:34 AM by liberasoft

error CS1548: Cryptographic failure while signing assembly 'C:\codeplex\SevenZipSharp\SevenZip\obj\Release\SevenZipSharp.dll' -- 'Error reading key file 'c:\codeplex\SevenZipSharp\SevenZip\SevenZip.snk' -- The system cannot find the file specified. '

Hi. Thank you for SevenZipSharp 0.64. When I get the latest source code and try to build it, I get the following compilation error: error CS1548: Cryptographic failure while signing assembly 'C:...

Id #13342 | Release: None | Updated: Dec 4, 2014 at 1:11 AM by icnocop | Created: Dec 4, 2014 at 1:09 AM by icnocop

SevenZipSharp throwing error while handling spanned bz2 & tar files

I am trying to extract the spanned bz2 and tar files using SevenZipSharp but it throws the below error The execution has failed due to the bug in the SevenZipSharp.\nPlease report about it to http...

Id #13310 | Release: None | Updated: Nov 4, 2014 at 10:23 PM by vayyadu | Created: Nov 4, 2014 at 10:23 PM by vayyadu

How can I get all the file names inside an archive “archive1.tar.gz” when in contains additional archives?

Hi, How can I get all the file names inside an archive “archive1.tar.gz” when in contains additional archives? For Example I have a main archive “archive1.zip” and it contains archive “archive2.ta...

Id #13276 | Release: None | Updated: Oct 11, 2014 at 7:56 AM by uarun007 | Created: Oct 11, 2014 at 7:56 AM by uarun007

Remove GC.Collect() or make it optional

There are two places in library where GC.Collect() is called affecting application performance. We use SevenZipSharp in an multithreaded application that extracts and processes thousands of files...

Id #13264 | Release: None | Updated: Aug 24, 2016 at 2:47 PM by mafutrct | Created: Sep 26, 2014 at 10:53 PM by Pavlushik

Problems activating Unofficial Skyrim Patch with Nexus Mod Manager

Nexus Mod Manager informed me, that it can not activate the Unofficial Skyrim Patch due to a bug with 7zip. I used the 7z920.exe to install 7zip and the and the Unofficial Skyrim Patch-19-2-0-6.7z ...

Id #13234 | Release: None | Updated: Sep 2, 2014 at 3:45 PM by ChicOnChocolate | Created: Sep 2, 2014 at 3:45 PM by ChicOnChocolate

SevenZipExtractor.cs _inStream.Dispose() needs null check

in SevenZipExtractor.cs, this relatively new code _inStream.Dispose(); should be if(_inStream != null) _inStream.Dispose(); It is possible somehow to get there with no _inStream (by using the co...

Id #13148 | Release: None | Updated: Feb 17, 2016 at 10:07 AM by icnocop | Created: Jul 22, 2014 at 7:46 AM by zeromus

Generic Error when trying to compress/decompress

I got a generic error when trying to compress and decompress a large object using x86 compilation. Maybe it's just an OutOfMemory error, but can't be sure because of the generic error. I do not k...

Id #13113 | Release: None | Updated: Jul 4, 2014 at 2:14 PM by iuridosanjos | Created: Jul 4, 2014 at 2:14 PM by iuridosanjos

Compressing event not fired

When compressing more than one file, Compressing event is not fired tried at least with the following: BeginCompressFiles(string archiveName, params string[] fileFullNames); CompressFiles(string ...

Id #12833 | Release: None | Updated: Dec 26, 2014 at 12:01 PM by quazi_node | Created: Mar 21, 2014 at 4:24 PM by duginov

SevenZip.SevenZipException: The execution has failed due to the bug in the SevenZipSharp

Hello. I keep getting the below exception from the "CompressFiles" when compressing a single binary file. 7z version: 0.64.3890.29348 code segment: ThreadPool.QueueUserWorkItem(new WaitCallback(d...

Id #12795 | Release: None | Updated: Dec 4, 2014 at 2:50 AM by icnocop | Created: Mar 3, 2014 at 5:55 AM by uniliner

Cannot set PPMD for zip, also AES + LZMA Crash

Hey guys, ive got 2 odd issues. First one is that if I set the compression format to zip, I cannot set the compression method to PPMD, it just jumps to default. Another Issue is that when I set e...

Id #12746 | Release: None | Updated: Feb 14, 2014 at 12:39 AM by Meganubis | Created: Feb 13, 2014 at 9:54 AM by Meganubis

Compress exception

SevenZip.SevenZipException: The execution has failed due to the bug in the SevenZipSharp. Please report about it to http://sevenzipsharp.codeplex.com/WorkItem/List.aspx, post the release number and...

Id #12745 | Release: None | Updated: Feb 13, 2014 at 2:17 AM by anothar | Created: Feb 13, 2014 at 2:17 AM by anothar

extraction issue

Hi, I am using SevenZipSharp to decompress a RAR archive and even though I set the "PreserveDirectoryStructure" flag to False, the folder(s) get extracted as empty folders. For example, if this i...

Id #12651 | Release: None | Updated: Jan 10, 2014 at 4:41 PM by hachir86 | Created: Jan 10, 2014 at 4:41 PM by hachir86

While compressing directory using 7z.dll in c# the first charecter is missing

I am using the below code to compress the directory. __var sevenZipArchive = new SevenZipCompress(); SevenZipBase.SetLibraryPath(@"7z.dll"); sevenZipArchive.CompressDirectory(DirectoryName, archive...

Id #12643 | Release: None | Updated: Jan 8, 2014 at 4:30 AM by muralinit | Created: Jan 8, 2014 at 4:30 AM by muralinit

Cannot find type System.MarshalByRefObject in module mscorlib.dll.

Hi, I am just trying to create a Metro app by using the SevenZipSharp. I have install the SevenZipSharp from nuget. but when I am building the project it gives me the following error. Error 1 Ca...

Id #12623 | Release: None | Updated: Dec 30, 2013 at 11:35 AM by ankur1987 | Created: Dec 30, 2013 at 11:34 AM by ankur1987

Library File Name Exception

Hi, In LibraryManager class, you set _libraryFileName like this : private static string _libraryFileName = ConfigurationManager.AppSettings["7zLocation"] ?? Path.Combine(Path.GetDi...

Id #12615 | Release: None | Updated: Dec 24, 2013 at 3:25 PM by kacem | Created: Dec 24, 2013 at 3:14 PM by kacem

This is probably a bug...

Hello SevenZip Team. I am receiving this error while attempting to save a game scenario I am building. Version is 0.64.3890.29348 Please see attached screenshot...

Id #12603 | Release: None | Updated: Dec 19, 2013 at 9:56 PM by AllenGibbs | Created: Dec 19, 2013 at 9:56 PM by AllenGibbs

Problem installation Skyrim Ultra HD texture pack with Nexus

Every time i try to install this mod with the Nexus, the program tells me "A problem occurred during install: The execution has failed due to the bug in sevenzipsharp. Please report about it to sev...

Id #12594 | Release: None | Updated: Dec 15, 2013 at 5:43 PM by Celodur | Created: Dec 15, 2013 at 5:43 PM by Celodur

Installation Failed (FireFall beta)

I have been trying to install this game for 48 hr now. Every time the installation finishes this error pops up saying " Installation Failed. An error occurred during installation : The execution ha...

Id #12548 | Release: None | Updated: Dec 4, 2013 at 9:57 AM by CaptianCripL | Created: Dec 4, 2013 at 9:57 AM by CaptianCripL

Failed due to the bug in SevenZipSharp

Hi I am having problems in installing a particular mod using the program Nexus Mod Manager for Fallout New Vegas - which happens to use your program. I can confirm that the file has no errors as I ...

Id #12525 | Release: None | Updated: Nov 29, 2013 at 12:27 AM by Number6670 | Created: Nov 29, 2013 at 12:25 AM by Number6670

Size limit while working with memory stream

I am passing array of bytes and using Memory Stream for compression and decompression. Code execute successfully up to some limit like below array size less than 100mb. Once size of byte array grow...

Id #12511 | Release: None | Updated: Nov 26, 2013 at 1:21 PM by vinay_jss | Created: Nov 26, 2013 at 1:21 PM by vinay_jss

bug in the SevenZipSharp at filename with in an archive having double quote

DLL: SevenZipSharp.dll Version: 0.64.4853.33402 My Observations: File name in an archive has (") but by using 7-zip software it converted in to Underscore (_) and extracted successfully. but by usi...

Id #12477 | Release: None | Updated: Nov 20, 2013 at 9:13 AM by sivakumarhyd1 | Created: Nov 20, 2013 at 8:51 AM by sivakumarhyd1

SevenZipExtractor.Check() takes 7 Seconds to Process!

Hey Guys, I am using Check to see if an archive is valid and/or if it needs a password, its usually fine, but when testing a archive with 1000+ files, it takes approximately 7 seconds to process a ...

Id #12426 | Release: None | Updated: Nov 3, 2013 at 12:54 PM by Meganubis | Created: Nov 3, 2013 at 12:54 PM by Meganubis

_unpackedSize = -1 ?

Hey Guys, SO im having trouble getting the upacked size of the archive in the compressor class, I know the archive has one, but why is it disabled?

Id #12417 | Release: None | Updated: Nov 1, 2013 at 8:05 AM by Meganubis | Created: Nov 1, 2013 at 8:05 AM by Meganubis

"failed due to the bug in SevenZipSharp."

Installing a Fallout 3 mod, "FWE Master Release 6-0 - Part 2-2761.7z" using the current Nexus Mod Manager (0.45.6) reported the attached Error.jpg. I tested the 7z archive using 7zip 9.20 and it pa...

Id #12180 | Release: None | Updated: Oct 2, 2013 at 9:36 AM by sorcer1 | Created: Sep 16, 2013 at 3:23 AM by BrookH

Exception in SevenZipLibraryManager

Whenever I try to set the Library path, I get the same exception - Invalid Path Exception in bei System.IO.Path.NormalizePath(String path, Boolean fullCheck, Int32 maxPathLength) bei System....

Id #12052 | Release: None | Updated: Aug 28, 2013 at 5:11 PM by Fumblesneeze | Created: Aug 20, 2013 at 1:11 PM by Fumblesneeze

SevenZipBase.GetUniqueID() leaks CPU ticks

SevenZipBase.GetUniqueID() calls List.Contains() on internal static list. The list grows by 1 with every call to GetUniqueID(). For compression-intensive applications that create a lot of compresso...

Id #11897 | Release: None | Updated: Jun 26, 2013 at 11:47 AM by vituha | Created: Jun 26, 2013 at 11:47 AM by vituha

File stream is not always closed in case of wrong password specified

SevenZipExtractor does not always close the extracted file in case wrong password is specified. I have noticed this issue extracting all files from password protected archives with one small and on...

Id #11889 | Release: None | Updated: Jun 20, 2013 at 10:45 PM by 4ameleon | Created: Jun 20, 2013 at 10:45 PM by 4ameleon

Failed to extract a file with invalid chars in its name

File names in archive may have some chars which are invalid in Windows file system. For example, angle brackets '<' and '>'. 7zip application replaces them with underscore '_' and has no problem to...

Id #11888 | Release: None | Updated: Feb 23, 2016 at 6:54 PM by IvanEMujicaR | Created: Jun 20, 2013 at 10:26 PM by 4ameleon

Multi-part archives with missing parts

I had no exception thrown when multi-part RAR archive is being opened and not all parts are available. The property SevenZipExtractor.VolumeFileNames returns available parts. I could find the only...

Id #11887 | Release: None | Updated: Jun 20, 2013 at 10:08 PM by 4ameleon | Created: Jun 20, 2013 at 10:08 PM by 4ameleon

The execution has failed due to the bug in the SevenZipSharp

Using SevenZipSharp.dll version 0.64.3890.29348. Getting this error on SevenZipExtractor.ExtractFile(int index, Stream stream) Thank you for any help! Best regards, Rob

Id #11857 | Release: None | Updated: Sep 6, 2013 at 3:50 AM by subtlesquire | Created: Jun 3, 2013 at 7:20 PM by robwins

SevenZipMono is missing files

The Mono project files COM.cs, InterfaceWrapper.cs and MonoSpec.cs files are not being tracked in the repository.

Id #11829 | Release: None | Updated: Jun 1, 2013 at 12:29 AM by Apelsin | Created: Jun 1, 2013 at 12:29 AM by Apelsin

Support for .Net Framework 4.5

Hi I was using SEVEN ZIP for one of my project developed on .Net Framework 4.0, when we moved to .Net framework 4.5 it stopped working and started giving error on stateformatter, please see the a...

Id #11805 | Release: None | Updated: Jun 11, 2013 at 4:18 PM by IQuixote | Created: May 23, 2013 at 5:09 PM by prashushetty

SevenZipExtractor.ExtractFile

The execution has failed due to the bug in the SevenZipSharp. Please report about it to http://sevenzipsharp.codeplex.com/WorkItem/List.aspx, post the release number and attach the archive. Seve...

Id #11782 | Release: None | Updated: May 15, 2013 at 10:20 AM by PantelisAr | Created: May 15, 2013 at 9:54 AM by PantelisAr

Getting the following error on CompressDirectory - SevenZip.SevenZipException : The execution has failed due to the bug in the SevenZipSharp.

When I attempt to call compress directory I am getting the following exception - SevenZip.SevenZipException : The execution has failed due to the bug in the SevenZipSharp. Please report about it...

Id #11670 | Release: None | Updated: May 26, 2013 at 6:58 PM by Leszekee | Created: Mar 29, 2013 at 5:10 AM by dhirajnayak

Installation Failed.

Just like countless other people here, I have experienced.... An error occurred during installation: The execution has failed due to the bug in the SevenZipSharp. Appreciate your attention on this ...

Id #11634 | Release: None | Updated: Mar 12, 2013 at 11:45 PM by LoogaBarooga | Created: Mar 12, 2013 at 11:45 PM by LoogaBarooga

Determine 7Zip path from registry

Alternately to setup 7Zip library location from application settings, determine the path under Windows from registry key "HKEY_LOCAL_MACHINE\SOFTWARE\7-Zip" and Value "@Path" of an installed 7Zip a...

Id #11630 | Release: None | Updated: Mar 12, 2013 at 4:43 PM by vbwebprofi | Created: Mar 12, 2013 at 4:43 PM by vbwebprofi

Installation failed (Bug in SevenZipSharp)

I got an error that went as follows: "Installation Failed. An error occurred during installation. The execution has failed due to the bug in the SevenZipSharp. Please report about it to http://sev...

Id #11582 | Release: None | Updated: Feb 22, 2013 at 12:15 AM by Psimon | Created: Feb 19, 2013 at 2:10 PM by Psimon

Issues Building Mods for Civ 5

I get the following error when building my mod for Civ 5 in ModBuddy C:\Program Files (x86)\MSBuild\Firaxis\ModBuddy\Civ5Mod.targets(128,9): error MSB4018: The "PackageMod" task failed unexpectedl...

Id #11580 | Release: None | Updated: Feb 27, 2013 at 8:29 AM by atrius84 | Created: Feb 18, 2013 at 9:20 AM by atrius84

Help Please

Uhm.... I was trying to install my FireFall Beta and near the end of the installation process, though, I received an error, it told me "Installation failed. An Error occurred during installation:...

Id #11521 | Release: None | Updated: Feb 22, 2013 at 12:15 AM by AngelousMortis | Created: Jan 24, 2013 at 9:37 PM by AngelousMortis